Issues

Filters

Apply Clear

Toggle_check # Tracker Status Priority Subject Author Assignee Updated
2499BugIn ProgressUrgentDRAGONFLY_3_2 lockd not responding correctlyNerzhul01/22/2013 12:47 PM
2414BugIn ProgressNormalLenovo S10 acpi freeze (not new)davshao01/14/2015 04:32 PM
2391BugIn ProgressNormalSystem lock with ahci and acpi enabled on ATI RS690 chipset with SMB600 sata controllerjorisgiovadaszi06/03/2015 03:51 PM
2386BugIn ProgressNormalfind: not working correctly on FAT32t_dfbsdtuxillo01/23/2013 03:19 AM
2360BugIn ProgressNormalWishlist: virtio driver importvsrinivas05/04/2012 09:28 PM
2358BugIn ProgressNormalDFBSD v3.0.2.32.g928ca - panic: hammer: insufficient undo FIFO space!tuxillotuxillo01/03/2015 05:04 PM
2353BugIn ProgressNormalpanic: assertion "gd->gd_spinlocks_wr == 0" failed in bsd4_schedulerclockjaydgalexh11/28/2012 01:57 AM
2351BugIn ProgressNormalDFBSD v3.1.0.579.g44ccf - Stuck during startup, random freezestuxillo04/24/2012 08:21 AM
2345BugIn ProgressNormalDFBSD v3.1.0.457.gd679f - NFS panic on diskless stationtuxillo04/07/2012 05:22 PM
2296BugIn ProgressHighpanic: assertion "m->wire_count > 0" failedthomas.nikolajsen08/30/2012 06:09 AM
2282BugIn ProgressNormalgdb segfaults with certain corefilestuxillo01/18/2012 04:40 PM
2013BugIn ProgressNormaloversized DMA request loopjosepht01/14/2015 03:48 PM
1843BugIn ProgressNormalFAST_IPSEC brokenthomas.nikolajsentuxillo12/05/2013 08:31 AM
1835BugIn ProgressNormalPanic: Bad link elm prev->next != elmftigeotdillon04/05/2011 06:16 PM
1749BugIn ProgressNormalHAMMER fsstress panic in hammer_flush_inode_core 'ip->flush_state != HAMMER_FST_FLUSH'vsrinivas01/19/2015 05:25 AM
1744BugIn ProgressNormalHAMMER fsstress panic in hammer_setup_child_callbackvsrinivas01/19/2015 04:35 AM
1716BugIn ProgressNormalcan't stop "bmake" (without args) in /usr/pkgsrcker2x01/19/2015 04:16 AM
1669BugIn ProgressNormalDrive wont open using buttonelekktretterr02/29/2012 12:05 PM
1661BugIn ProgressNormalpanic on password entry mount smb filesystemvsrinivas01/19/2015 03:29 AM
1645BugIn ProgressLowmsdos utility (sbin) patchespfgshield-freebsdsjg09/10/2010 02:18 AM
1584BugIn ProgressNormalcan't use ssh from jail: debug1: read_passphrase: can't open /dev/tty: Device busycorecodetuxillo02/20/2014 07:30 AM
1583BugIn ProgressNormalpanic: assertion: cursor->trans->sync_lock_refs > 0 in hammer_recover_cursorcorecodetuxillo02/20/2014 07:31 AM
1547BugIn ProgressNormaldisklabel64 automatic sizingcorecodetuxillo02/20/2014 07:29 AM
1528BugIn ProgressNormalktrace does not show proper return values for pipe(2)corecodetuxillo02/20/2014 07:32 AM
1502BugIn ProgressNormalLock while deleting files from nohistory HAMMER directorieshasso03/10/2013 04:28 AM
1476BugIn ProgressLowWe miss fdatasync()hasso03/10/2013 04:00 AM
1475BugIn ProgressNormalkernel blocks with low memory and syscons setting a high res mode / scrollbackcorecodetuxillo02/20/2014 07:03 AM
1469BugIn ProgressNormalHammer history security concerncorecodetuxillo02/24/2014 01:56 AM
1398SubmitIn ProgressNormalhdestroy(3) restricts hash key to point to malloc'ed spaceAnonymous01/15/2015 08:11 AM
1390BugIn ProgressNormalUse id_t type for {get,set}priority()Anonymoustuxillo06/02/2014 06:21 AM
1368BugIn ProgressNormalsuspend signal race?qhwt+dfly02/18/2014 03:07 AM
1336BugIn ProgressNormalStill looking for reports of missed directory entries w/ HAMMERdillon01/14/2015 05:08 PM
1307BugIn ProgressNormalhammer tid -2 shows unexpected resultcorecodetuxillo02/20/2014 06:57 AM
1302BugIn ProgressNormalCheckpoint regression?sjgsjg07/10/2013 05:22 PM
1218BugIn ProgressNormalpanic: assertion: error == 0 in hammer_start_transactionrumcic01/19/2015 03:49 AM
1181BugIn ProgressNormalACX111 panicelekktretterr01/15/2015 12:04 AM
1148BugIn ProgressLowBCM4311 wireless network adapter detected but not functionalarchimedes.gaviola01/15/2015 12:10 AM
1030BugIn ProgressNormalmsdosfs umount paniccorecodetuxillo02/20/2014 07:01 AM
998BugIn ProgressNormalUnconfiguring a vn while it is mountedrumcictuxillo01/14/2015 05:03 PM
884BugIn ProgressHighPerformance/memory problems under filesystem IO loadhasso02/18/2014 08:07 AM
781BugIn ProgressNormalfdisk uses wrong geometry on usb flash drivescorecodetuxillo02/20/2014 07:16 AM
742BugIn ProgressNormalumount problems with multiple mountscorecodetuxillo02/20/2014 06:54 AM
725BugIn ProgressLow'make distribution' fails w/'ro' /usr/objc.turner03/09/2013 01:01 PM
604BugIn ProgressNormal1.8.1-RELEASE - clock runs fast on mainboard ASUS P5A-Byeti11/18/2014 09:41 AM
572BugIn ProgressNormalInstaller: no option to set geometry/corrupts partition tablerandux03/09/2013 12:32 PM
331BugIn ProgressNormalftpsesame (aka Bridging S01E03)bastyaelvtars03/09/2013 12:28 PM
168BugIn ProgressNormalLivelocked limit engaged while trying to setup IPW wirelessmschachtsepherosa01/14/2015 04:52 PM
118BugIn ProgressLowjails clean startupbelczyk03/12/2013 05:56 AM
2921SubmitNewNormalAllow moused to accept userland mouse eventstautolog06/10/2016 02:38 PM
2920SubmitNewNormal_ascii_wcsnrtombs, _ascii_mbsnrtowcs, and _none_wcsnrtombs neglect to set src on EILSEQ errorRockinRoeldragonflybsd106/19/2016 02:11 AM
2917BugNewNormalda8: reading primary partition table: error accessing offset 000000000000 for 512liweitianux06/03/2016 05:20 AM
2915BugNewHighHammer mirror-copy problemt_dfbsd05/31/2016 01:26 PM
2899BugNewNormalInstall DragonFly to SD carddpostolov06/04/2016 10:44 AM
2898BugNewNormalHAMMER panicpavalos04/06/2016 03:17 AM
2897BugNewNormalDefault compiler ignores LIBRARY_PATHenric06/19/2016 03:08 AM
2892BugNewNormalswap_pager:indefinite wait bufferf errorlhmwzy02/21/2016 10:32 PM
2891BugNewNormalKernel panic in IEEE802.11 related codeshamaz05/29/2016 05:49 PM
2890BugNewNormalnot able to boot usb installer on Toshiba Chromebook 2johnnywhishbone02/22/2016 03:42 AM
2887BugNewLowMissing extattr_namespace_to_string and extattr_string_to_namespace functionsrubenk02/06/2016 05:09 AM
2886BugNewNormaldragonfly mail agent: sending a testmail causes high system loadworf02/05/2016 05:53 AM
2882BugNewLowbridge sends packets from individual interfacesarcade@b1t.name01/09/2016 12:43 PM
2881BugNewNormalPulseaudio hangs/resets system when starting X11mneumann01/09/2016 03:08 AM
2878BugNewLow[fix] CCVER problem when using clang and cpu extensions (intrinsics)arcade@b1t.name06/24/2016 04:25 AM
2877BugNewLowsed fails when working with UTF-8 locale and non-UTF symbolsarcade@b1t.name12/30/2015 11:20 AM
2876SubmitNewNormalfdisk(8): cleanups and bug fixes0xAX12/28/2015 05:03 AM
2875SubmitNewNormalMove part_type structure definition to the <sys/sysids.h>0xAX12/26/2015 10:56 PM
2874BugNewNormalmake world DESTDIR=/emptydir failspascii12/25/2015 07:04 AM
2871BugNewLowhammer2 kernel crasharcade@b1t.name12/23/2015 02:52 PM
2870BugNewHighBroken text and icons when glamor acceleration is used375gnuftigeot01/31/2016 12:13 AM
2868BugNewLowtmpfs problems: incorrect size, no auto-sizearcade@b1t.name12/22/2015 02:23 AM
2863BugNewNormalHAMMER synch tid is zeroshamaz12/12/2015 11:24 PM
2859BugNewLowInstaller configuration menu always highlights "Select timezone", no matter which step was last completed.cgag12/02/2015 01:54 PM
2858BugNewLowInstaller "Local or UTC" question should have "No" selected by default.cgag12/02/2015 01:18 PM
2857BugNewNormalhammer stalls via bitcoin-qttkusumi11/30/2015 06:52 AM
2856BugNewNormalbuild failed for some dport packages due to automake updatebaggiokwok211/30/2015 08:20 AM
2852BugNewNormalHammer File System - hangs on undo during system boot / mount - will not recover on DragonFlyBSD newer than 3.6.0abale11/22/2015 06:12 PM
2840BugNewNormalwrong voltage is reportedyellowrabbit201009/11/2015 06:09 PM
2835BugNewNormal/usr/include/c++/5.0/bits/c++locale.h likes _POSIX_C_SOURCE>=200809davshao11/18/2015 03:40 AM
2829SubmitNewNormalcopyright noticesalvarez06/14/2015 02:48 PM
2828BugNewHighOn AMD APUs and Bulldozer CPUs, the machdep.cpu_idle_hlt sysctl should be 3 by defaultvadaszivadaszi07/23/2015 05:30 PM
2825BugNewHigh3x dhclient = hanging system (objcache exhausted)jaccovonbsepherosa07/23/2015 03:14 PM
2822BugNewNormalUSB 3.0 stick throws "reading primary partition table: error accessing offset 000[...] for 152" error, while the stick works on any other OS I testedrevuwaprofmakx06/29/2015 05:56 AM
2820BugNewNormalTP-Link USB Wi-Fi adapter cannot be reattached to the systemshamaz05/22/2015 09:45 PM
2817BugNewNormalPermission checking for utimes(2) and friends are not properly honouredstatelessdillon05/23/2015 09:25 PM
2816BugNewNormalA multitasking process being debugged can get stuckphma05/19/2015 03:57 AM
2812BugNewNormalPanic on Intel DE3815TYKHEtmorp05/14/2015 03:14 PM
2809BugNewNormalhammer mirror-streammasu04/10/2015 12:33 AM
2808BugNewNormalX freeze by switching between X and VT - results in black screenlukesky33309/24/2015 05:44 AM
2806BugNewNormalfailed to configure a link-local address on ath0 (errno = 22)Chingyuan04/22/2015 01:42 PM
2803BugNewNormalHAMMER: Warning: UNDO area too small!ftigeot03/11/2015 03:42 PM
2802BugNewNormalUSB Wifi urtwn0 crash from cd bootopvalues03/10/2015 01:07 AM
2799BugNewNormalFatal trap 12 caused by moused(8) -p /dev/cual0opvalues03/04/2015 11:01 PM
2790SubmitNewLowfiledesc softrefs increment code factoringdclink02/21/2015 04:00 AM
2789BugNewNormalre: Tcplay ---> Could not open /dev/cryptogarytivey51202/16/2015 10:53 AM
2788BugNewNormalioctl GSLICEINFO: Not working for vnode slicemneumann02/12/2015 07:49 AM
2758BugNewNormalIncorrect info in arc4random(3) manual pagerobin.carey101/05/2015 05:14 AM
2751BugNewNormaluse iconv under php 5.3.29 can cause php core dumpedlhmwzy03/27/2015 01:56 AM
2747SubmitNewNormalRe: IPFW2 status updatebycn8212/21/2014 01:54 AM
2746BugNewNormalsome fraction of xterms started from the xmonad window manager get killed with SIGALRMisenmannprofmakx12/28/2014 02:51 AM
2744SubmitNewNormalRe: IPFW2 status updatebycn8212/07/2014 07:55 PM

1 2 3 4 5 (101-200/490) Per page: 25, 50, 100

Also available in: Atom CSV PDF