Project

General

Profile

Issues

Filters

Apply Clear

# Tracker Status Priority Subject Author Assignee Updated
2808 Bug New Normal X freeze by switching between X and VT - results in black screen lukesky333 09/24/2015 05:44 AM
2809 Bug New Normal hammer mirror-stream masu 04/10/2015 12:33 AM
2812 Bug New Normal Panic on Intel DE3815TYKHE tmorp 05/14/2015 03:14 PM
2816 Bug New Normal A multitasking process being debugged can get stuck phma 05/19/2015 03:57 AM
2817 Bug New Normal Permission checking for utimes(2) and friends are not properly honoured stateless dillon 05/23/2015 09:25 PM
2820 Bug New Normal TP-Link USB Wi-Fi adapter cannot be reattached to the system shamaz 05/22/2015 09:45 PM
2822 Bug New Normal USB 3.0 stick throws "reading primary partition table: error accessing offset 000[...] for 152" error, while the stick works on any other OS I tested revuwa profmakx 06/29/2015 05:56 AM
2835 Bug New Normal /usr/include/c++/5.0/bits/c++locale.h likes _POSIX_C_SOURCE>=200809 davshao 11/18/2015 03:40 AM
2840 Bug New Normal wrong voltage is reported yellowrabbit2010 09/11/2015 06:09 PM
2852 Bug New Normal Hammer File System - hangs on undo during system boot / mount - will not recover on DragonFlyBSD newer than 3.6.0 abale 11/22/2015 06:12 PM
2856 Bug New Normal build failed for some dport packages due to automake update baggiokwok2 11/30/2015 08:20 AM
2857 Bug New Normal hammer stalls via bitcoin-qt tkusumi 11/30/2015 06:52 AM
2863 Bug New Normal HAMMER synch tid is zero shamaz 12/12/2015 11:24 PM
2874 Bug New Normal make world DESTDIR=/emptydir fails pascii 12/25/2015 07:04 AM
2881 Bug New Normal Pulseaudio hangs/resets system when starting X11 mneumann 01/09/2016 03:08 AM
2886 Bug New Normal dragonfly mail agent: sending a testmail causes high system load worf 02/05/2016 05:53 AM
2890 Bug New Normal not able to boot usb installer on Toshiba Chromebook 2 johnnywhishbone 02/22/2016 03:42 AM
2891 Bug New Normal Kernel panic in IEEE802.11 related code shamaz 05/29/2016 05:49 PM
2892 Bug New Normal swap_pager:indefinite wait bufferf error lhmwzy 02/21/2016 10:32 PM
2897 Bug New Normal Default compiler ignores LIBRARY_PATH enric 06/19/2016 03:08 AM
2898 Bug New Normal HAMMER panic pavalos 04/06/2016 03:17 AM
2899 Bug New Normal Install DragonFly to SD card dpostolov 05/13/2017 03:46 AM
2917 Bug New Normal da8: reading primary partition table: error accessing offset 000000000000 for 512 liweitianux 09/19/2017 06:29 PM
2924 Bug New Normal cat -v fails to tag characters in extended table with M- prefix with some locales sevan 07/11/2016 07:18 AM
2936 Bug New Normal loader.efi crashes while loading kernel spaceille 08/20/2016 06:17 AM
2951 Bug New Normal clock_gettime always repots 0 sec, 0 nsec zhtw 10/04/2016 06:55 AM
2953 Bug New Normal open(2) returns "Permission denied" instead of "File exists" zhtw 09/22/2016 11:55 PM
2956 Bug New Normal py27-livestreamer-1.12.2 conflicts with py27-rainbowstream-1.3.5 htse 10/07/2016 04:07 PM
2969 Bug New Normal CERT VU#548487 libc vulnerability in link_ntoa() benjolitz 12/06/2016 11:37 AM
2970 Bug New Normal kernel 4.7: "ls -l" causes panic on UDF filesystem: "bgetvp - overlapping buffer" peeter 12/21/2016 02:46 AM
2971 Bug New Normal kernel 4.7: buildworld causes panic: Bad link elm 0xffffffe1c766d500 prev->next != elm peeter 12/22/2016 06:26 AM
2972 Bug New Normal ipfw3 "deny to me" does not work correctly mneumann 12/27/2016 12:11 PM
2974 Bug New Normal firefox segfaults on certain pages unless ENV "force_s3tc_enable" is set mneumann 12/28/2016 12:41 PM
2978 Bug New Normal [dbus] /etc/machine-id does not exist abyxcos 03/04/2017 09:31 PM
2981 Bug New Normal dd crashes system if bs > 1g tpchin 02/18/2017 05:02 PM
2982 Bug New Normal Failed compile due to fetch.h and MAXHOSTNAMELEN noloader 02/19/2017 10:49 AM
2983 Bug New Normal Video artifacts after recent Xorg upgrade on Radeon HD 7560D (AMD GPU) arcade@b1t.name 02/23/2017 06:00 AM
2994 Bug New Normal Intermittent boot hangs after git: hammer - HAMMER Version 7 davshao 03/30/2017 02:06 PM
3006 Bug New Normal boot0cfg: panic in kern_udev.c in function _udev_dict_set_cstr when installing in VirtualBox MichiGreat 04/01/2017 02:22 PM
3015 Bug New Normal sbin/gpt/show.c:133: do we always find what we are looking for ? dcb 04/11/2017 11:11 AM
3016 Bug New Normal sbin/hammer2/cmd_snapshot.c:113]: (error) Memory leak: xname dcb 04/11/2017 11:20 AM
3017 Bug New Normal sbin/ipfw3/ipfw3.c:2519: redundant compare ? dcb 04/11/2017 11:22 AM
3018 Bug New Normal sys/bus/u4b/wlan/if_run.c:5464]: (style) Redundant condition dcb 04/11/2017 11:26 AM
3022 Bug New Normal sys/dev/netif/ath/ath/if_ath.c:2142: strange bitmask ? dcb 04/11/2017 11:49 AM
3025 Bug New Normal sys/dev/powermng/powernow/powernow.c:284: bad comparison ? dcb 09/23/2017 07:45 AM
3028 Bug New Normal installer: confusion of set/get disk encryption passphrase dialogs liweitianux 04/13/2017 11:33 PM
3029 Bug New Normal Running DflyBSD 4.8 on FreeBSD bhyve as a guest iron 04/27/2017 10:32 AM
3033 Bug New Normal dfly-x86_64-4.8.0_REL.img checksum!! mbzadegan 05/09/2017 03:56 AM
3034 Bug New Normal Tail -n 1 don't work on /proc/curproc/map cpk 11/26/2017 06:52 AM
3035 Bug New Normal panic: assertion "cpu >= 0 && cpu < ncpus" failed in netisr_cpuport at /usr/src/sys/net/netisr2.h:87 masu 05/11/2017 01:24 AM
3036 Bug New Normal panic in icmp_redirect_start() ASSERT_IN_NETISR(0) tautolog 05/11/2017 07:27 PM
3045 Bug New Normal net.inet.ip.fastforwarding causes PF NAT to break/duplicate packets benjolitz 08/29/2017 10:14 AM
3047 Bug New Normal HAMMER critical write error samuel 07/29/2017 04:09 AM
3048 Bug New Normal natacontrol & virtio Savaoff 07/29/2017 06:20 AM
3049 Bug New Normal panic DragonFly v4.8.1-RELEASE by mounting a malformed msdosfs image [12.128] open.source@ribose.com 08/14/2017 02:53 AM
3051 Bug New Normal panic DragonFly v4.8.1-RELEASE by mounting a malformed NTFS image [12.000] open.source@ribose.com 08/14/2017 03:20 AM
3052 Bug New Normal panic DragonFly v4.8.1-RELEASE by mounting a malformed NTFS image [64.000] open.source@ribose.com 08/14/2017 03:22 AM
3076 Bug New Normal sys/dev/netif/ig_hal/e1000_ich8lan.c:1594: sanity checking mixup ? dcb 10/11/2017 01:58 AM
3081 Bug New Normal Cannot install npm package eslint ollehar 10/15/2017 03:02 AM
3082 Bug New Normal network hangs daftaupe 10/17/2017 08:21 AM
3083 Bug New Normal crypto/openssh/auth2-pubkey.c:186]: (style) Suspicious condition dcb 10/17/2017 09:36 AM
3091 Bug New Normal swapinfo print major/minor number when device name too long liweitianux 10/23/2017 04:42 AM
3092 Bug New Normal dumpon: sysctl: kern.dumpdev: Device busy liweitianux 10/25/2017 02:09 AM
3096 Bug New Normal VM bug in pmap code. arcade@b1t.name 12/26/2017 10:21 PM
3098 Bug New Normal Segmentation Fault mbzadegan 11/06/2017 01:33 AM
3105 Bug New Normal Asus E200HA keyboard does not work Pedro 11/22/2017 05:08 AM
3107 Bug New Normal ACPI interrupt storm when loading i915 on Lenovo T460 oyvinht 12/04/2017 05:41 AM
3110 Bug New Normal crash with ipfw3 under load bnegre82 12/09/2017 06:22 AM
3116 Bug New Normal da0 detects on very big volume if to _remove_ usb install stick and reboot on Intel NUC5PPYH dpostolov 01/07/2018 09:40 PM
3117 Bug New Normal Problem with colours if "intel" video-driver used dpostolov 01/07/2018 11:35 PM
3120 Bug New Normal Intel AC 8260 firmware does not load Vintodrimmer 04/24/2018 12:21 AM
3121 Bug New Normal test issue tuxillo 02/09/2018 09:18 AM
3123 Bug New Normal crypto/openssh/channels.c:3258: bad if statement ? dcb 02/22/2018 09:19 AM
3134 Bug New Normal RFC 3021 (/31 networks) appear to be unsupported jailbird 05/16/2018 11:03 PM
3136 Bug New Normal Xorg freezes on radeon: Xorg and kernel (ttm swap) in "lwe" peeter 06/16/2018 05:53 AM
3139 Bug New Normal USB Mouse Does Not Work in DragonflyBSD guest on VirtualBox chiguy1256 06/14/2018 02:28 PM
1398 Submit In Progress Normal hdestroy(3) restricts hash key to point to malloc'ed space Anonymous 01/15/2015 08:11 AM
2525 Submit In Progress Normal [PATCH] Small Fixes Gwenio 03/09/2013 03:35 AM
3031 Submit In Progress Normal Update drm/radeon to Linux 4.7.10 as much as possible davshao ftigeot 07/06/2017 02:38 AM
168 Bug In Progress Normal Livelocked limit engaged while trying to setup IPW wireless mschacht sepherosa 01/14/2015 04:52 PM
331 Bug In Progress Normal ftpsesame (aka Bridging S01E03) bastyaelvtars 03/09/2013 12:28 PM
572 Bug In Progress Normal Installer: no option to set geometry/corrupts partition table randux 03/09/2013 12:32 PM
604 Bug In Progress Normal 1.8.1-RELEASE - clock runs fast on mainboard ASUS P5A-B yeti 11/18/2014 09:41 AM
742 Bug In Progress Normal umount problems with multiple mounts corecode tuxillo 02/20/2014 06:54 AM
781 Bug In Progress Normal fdisk uses wrong geometry on usb flash drives corecode tuxillo 02/20/2014 07:16 AM
998 Bug In Progress Normal Unconfiguring a vn while it is mounted rumcic tuxillo 01/14/2015 05:03 PM
1030 Bug In Progress Normal msdosfs umount panic corecode tuxillo 02/20/2014 07:01 AM
1181 Bug In Progress Normal ACX111 panic elekktretterr 01/15/2015 12:04 AM
1218 Bug In Progress Normal panic: assertion: error == 0 in hammer_start_transaction rumcic 01/19/2015 03:49 AM
1302 Bug In Progress Normal Checkpoint regression? sjg sjg 07/10/2013 05:22 PM
1307 Bug In Progress Normal hammer tid -2 shows unexpected result corecode 10/18/2016 05:29 PM
1336 Bug In Progress Normal Still looking for reports of missed directory entries w/ HAMMER dillon 01/14/2015 05:08 PM
1368 Bug In Progress Normal suspend signal race? qhwt+dfly 02/18/2014 03:07 AM
1390 Bug In Progress Normal Use id_t type for {get,set}priority() Anonymous tuxillo 06/02/2014 06:21 AM
1469 Bug In Progress Normal Hammer history security concern corecode tuxillo 02/24/2014 01:56 AM
1475 Bug In Progress Normal kernel blocks with low memory and syscons setting a high res mode / scrollback corecode tuxillo 02/20/2014 07:03 AM
1502 Bug In Progress Normal Lock while deleting files from nohistory HAMMER directories hasso 03/10/2013 04:28 AM
1528 Bug In Progress Normal ktrace does not show proper return values for pipe(2) corecode tuxillo 02/20/2014 07:32 AM
1547 Bug In Progress Normal disklabel64 automatic sizing corecode tuxillo 02/20/2014 07:29 AM
1583 Bug In Progress Normal panic: assertion: cursor->trans->sync_lock_refs > 0 in hammer_recover_cursor corecode tuxillo 02/20/2014 07:31 AM
(301-400/564) Per page: 25, 50, 100

Also available in: Atom CSV PDF