Apply Clear

# Tracker Status Priority Subject Author Assignee Updated
2809BugNewNormalhammer mirror-streammasu04/10/2015 12:33 AM
2812BugNewNormalPanic on Intel DE3815TYKHEtmorp05/14/2015 03:14 PM
2816BugNewNormalA multitasking process being debugged can get stuckphma05/19/2015 03:57 AM
2817BugNewNormalPermission checking for utimes(2) and friends are not properly honouredstatelessdillon05/23/2015 09:25 PM
2820BugNewNormalTP-Link USB Wi-Fi adapter cannot be reattached to the systemshamaz05/22/2015 09:45 PM
2822BugNewNormalUSB 3.0 stick throws "reading primary partition table: error accessing offset 000[...] for 152" error, while the stick works on any other OS I testedrevuwaprofmakx06/29/2015 05:56 AM
2825BugNewHigh3x dhclient = hanging system (objcache exhausted)jaccovonbsepherosa07/23/2015 03:14 PM
2828BugNewHighOn AMD APUs and Bulldozer CPUs, the machdep.cpu_idle_hlt sysctl should be 3 by defaultvadaszivadaszi07/23/2015 05:30 PM
2829SubmitNewNormalcopyright noticesalvarez06/14/2015 02:48 PM
2835BugNewNormal/usr/include/c++/5.0/bits/c++locale.h likes _POSIX_C_SOURCE>=200809davshao11/18/2015 03:40 AM
2840BugNewNormalwrong voltage is reportedyellowrabbit201009/11/2015 06:09 PM
2852BugNewNormalHammer File System - hangs on undo during system boot / mount - will not recover on DragonFlyBSD newer than 3.6.0abale11/22/2015 06:12 PM
2856BugNewNormalbuild failed for some dport packages due to automake updatebaggiokwok211/30/2015 08:20 AM
2857BugNewNormalhammer stalls via bitcoin-qttkusumi11/30/2015 06:52 AM
2858BugNewLowInstaller "Local or UTC" question should have "No" selected by default.cgag12/02/2015 01:18 PM
2859BugNewLowInstaller configuration menu always highlights "Select timezone", no matter which step was last completed.cgag12/02/2015 01:54 PM
2863BugNewNormalHAMMER synch tid is zeroshamaz12/12/2015 11:24 PM
2868BugNewLowtmpfs problems: incorrect size, no auto-sizearcade@b1t.name12/22/2015 02:23 AM
2870BugNewHighBroken text and icons when glamor acceleration is used375gnuftigeot01/31/2016 12:13 AM
2871BugNewLowhammer2 kernel crasharcade@b1t.name12/23/2015 02:52 PM
2874BugNewNormalmake world DESTDIR=/emptydir failspascii12/25/2015 07:04 AM
2875SubmitNewNormalMove part_type structure definition to the <sys/sysids.h>Anonymous12/26/2015 10:56 PM
2876SubmitNewNormalfdisk(8): cleanups and bug fixesAnonymous12/28/2015 05:03 AM
2877BugNewLowsed fails when working with UTF-8 locale and non-UTF symbolsarcade@b1t.name12/30/2015 11:20 AM
2878BugNewLow[fix] CCVER problem when using clang and cpu extensions (intrinsics)arcade@b1t.name06/24/2016 04:25 AM
2881BugNewNormalPulseaudio hangs/resets system when starting X11mneumann01/09/2016 03:08 AM
2882BugNewLowbridge sends packets from individual interfacesarcade@b1t.name01/09/2016 12:43 PM
2886BugNewNormaldragonfly mail agent: sending a testmail causes high system loadworf02/05/2016 05:53 AM
2887BugNewLowMissing extattr_namespace_to_string and extattr_string_to_namespace functionsrubenk02/06/2016 05:09 AM
2890BugNewNormalnot able to boot usb installer on Toshiba Chromebook 2johnnywhishbone02/22/2016 03:42 AM
2891BugNewNormalKernel panic in IEEE802.11 related codeshamaz05/29/2016 05:49 PM
2892BugNewNormalswap_pager:indefinite wait bufferf errorlhmwzy02/21/2016 10:32 PM
2897BugNewNormalDefault compiler ignores LIBRARY_PATHenric06/19/2016 03:08 AM
2898BugNewNormalHAMMER panicpavalos04/06/2016 03:17 AM
2899BugNewNormalInstall DragonFly to SD carddpostolov06/04/2016 10:44 AM
2915BugNewHighHammer mirror-copy problemt_dfbsd08/25/2016 05:28 AM
2917BugNewNormalda8: reading primary partition table: error accessing offset 000000000000 for 512liweitianux09/01/2016 09:43 AM
2920SubmitNewNormal_ascii_wcsnrtombs, _ascii_mbsnrtowcs, and _none_wcsnrtombs neglect to set src on EILSEQ errorRockinRoeldragonflybsd106/19/2016 02:11 AM
2921SubmitNewNormalAllow moused to accept userland mouse eventstautolog06/10/2016 02:38 PM
2923BugNewNormalkernel module i915 leads to frozen screen on 15" macbookpro6,2 peeter07/06/2016 06:19 AM
2924BugNewNormalcat -v fails to tag characters in extended table with M- prefix with some localessevan07/11/2016 07:18 AM
2926BugNewNormalgetfsstat() can return the wrong mounted FS countt_dfbsd09/01/2016 09:18 AM
2930BugNewHigh'objcache' causes panic during 'nfs_readdir'tofergus07/26/2016 01:09 PM
2931BugNewLow'gdb' of 'vkernel' unable to print backtracetofergus07/26/2016 01:51 PM
2932BugNewNormalpanic if laptop sleeps with external monitor plugged incmusser07/28/2016 02:46 PM
2933SubmitNewNormalRemove unix domain socket support from cat(1)sevan08/01/2016 08:10 PM
2935BugNewLowjail.allow_raw_sockets and jail.chflags_allowed undocumentedcgag08/07/2016 05:07 PM
2936BugNewNormalloader.efi crashes while loading kernelspaceille08/20/2016 06:17 AM
2937SubmitNewNormalbin/chio/chio.1 - Add HISTORY sectionsevan08/21/2016 05:47 PM
2938SubmitNewNormalbin/dd/dd.1 - Add HISTORY sectionsevan08/22/2016 08:53 PM
2939SubmitNewNormalbin/echo/echo.1 - Add HISTORY sectionsevan08/22/2016 09:01 PM
2940SubmitNewNormalbin/expr/expr.1 - Add HISTORY sectionsevan08/23/2016 05:45 AM
2941SubmitNewNormalbin/kill/kill.1 - Add note in HISTORY sectionsevan08/22/2016 09:12 PM
2942SubmitNewNormalbin/ps/ps.1 - Correct HISTORY sectionsevan08/22/2016 09:20 PM
2943SubmitNewNormalbin/pwd/pwd.1 - Add HISTORY sectionsevan08/22/2016 09:23 PM
2944SubmitNewNormalbin/stty/stty.1 - Add HISTORY sectionsevan08/22/2016 09:31 PM
2945SubmitNewNormalbin/test/test.1 - Add HISTORY sectionsevan08/22/2016 09:34 PM
2947BugNewNormalerror: 'HostNativeThread' does not name a type while building LLVM portrafaelbfs08/29/2016 06:18 AM
2948BugNewNormalbin/chmod - Fix commentsevan09/02/2016 10:46 AM
2950BugNewNormalHISTORY for src/sbin/*sevan09/20/2016 07:50 PM
2951BugNewNormalclock_gettime always repots 0 sec, 0 nseczhtw10/04/2016 06:55 AM
2953BugNewNormalopen(2) returns "Permission denied" instead of "File exists"zhtw09/22/2016 11:55 PM
2955SubmitNewNormalPossibility to remove pthread_cancel symbol from libczrj10/07/2016 06:05 AM
2956BugNewNormalpy27-livestreamer-1.12.2 conflicts with py27-rainbowstream-1.3.5htse10/07/2016 04:07 PM
118BugIn ProgressLowjails clean startupbelczyk03/12/2013 05:56 AM
168BugIn ProgressNormalLivelocked limit engaged while trying to setup IPW wirelessmschachtsepherosa01/14/2015 04:52 PM
331BugIn ProgressNormalftpsesame (aka Bridging S01E03)bastyaelvtars03/09/2013 12:28 PM
572BugIn ProgressNormalInstaller: no option to set geometry/corrupts partition tablerandux03/09/2013 12:32 PM
604BugIn ProgressNormal1.8.1-RELEASE - clock runs fast on mainboard ASUS P5A-Byeti11/18/2014 09:41 AM
725BugIn ProgressLow'make distribution' fails w/'ro' /usr/objc.turner03/09/2013 01:01 PM
742BugIn ProgressNormalumount problems with multiple mountscorecodetuxillo02/20/2014 06:54 AM
781BugIn ProgressNormalfdisk uses wrong geometry on usb flash drivescorecodetuxillo02/20/2014 07:16 AM
884BugIn ProgressHighPerformance/memory problems under filesystem IO loadhasso02/18/2014 08:07 AM
998BugIn ProgressNormalUnconfiguring a vn while it is mountedrumcictuxillo01/14/2015 05:03 PM
1030BugIn ProgressNormalmsdosfs umount paniccorecodetuxillo02/20/2014 07:01 AM
1148BugIn ProgressLowBCM4311 wireless network adapter detected but not functionalarchimedes.gaviola01/15/2015 12:10 AM
1181BugIn ProgressNormalACX111 panicelekktretterr01/15/2015 12:04 AM
1218BugIn ProgressNormalpanic: assertion: error == 0 in hammer_start_transactionrumcic01/19/2015 03:49 AM
1302BugIn ProgressNormalCheckpoint regression?sjgsjg07/10/2013 05:22 PM
1307BugIn ProgressNormalhammer tid -2 shows unexpected resultcorecode10/18/2016 05:29 PM
1336BugIn ProgressNormalStill looking for reports of missed directory entries w/ HAMMERdillon01/14/2015 05:08 PM
1368BugIn ProgressNormalsuspend signal race?qhwt+dfly02/18/2014 03:07 AM
1390BugIn ProgressNormalUse id_t type for {get,set}priority()Anonymoustuxillo06/02/2014 06:21 AM
1398SubmitIn ProgressNormalhdestroy(3) restricts hash key to point to malloc'ed spaceAnonymous01/15/2015 08:11 AM
1469BugIn ProgressNormalHammer history security concerncorecodetuxillo02/24/2014 01:56 AM
1475BugIn ProgressNormalkernel blocks with low memory and syscons setting a high res mode / scrollbackcorecodetuxillo02/20/2014 07:03 AM
1476BugIn ProgressLowWe miss fdatasync()hasso03/10/2013 04:00 AM
1502BugIn ProgressNormalLock while deleting files from nohistory HAMMER directorieshasso03/10/2013 04:28 AM
1528BugIn ProgressNormalktrace does not show proper return values for pipe(2)corecodetuxillo02/20/2014 07:32 AM
1547BugIn ProgressNormaldisklabel64 automatic sizingcorecodetuxillo02/20/2014 07:29 AM
1583BugIn ProgressNormalpanic: assertion: cursor->trans->sync_lock_refs > 0 in hammer_recover_cursorcorecodetuxillo02/20/2014 07:31 AM
1584BugIn ProgressNormalcan't use ssh from jail: debug1: read_passphrase: can't open /dev/tty: Device busycorecodetuxillo02/20/2014 07:30 AM
1645BugIn ProgressLowmsdos utility (sbin) patchespfgshield-freebsdsjg09/10/2010 02:18 AM
1661BugIn ProgressNormalpanic on password entry mount smb filesystemvsrinivas08/06/2016 12:15 AM
1669BugIn ProgressNormalDrive wont open using buttonelekktretterr02/29/2012 12:05 PM
1716BugIn ProgressNormalcan't stop "bmake" (without args) in /usr/pkgsrcker2x01/19/2015 04:16 AM
1744BugIn ProgressNormalHAMMER fsstress panic in hammer_setup_child_callbackvsrinivas01/19/2015 04:35 AM
1749BugIn ProgressNormalHAMMER fsstress panic in hammer_flush_inode_core 'ip->flush_state != HAMMER_FST_FLUSH'vsrinivas01/19/2015 05:25 AM
1843BugIn ProgressNormalFAST_IPSEC brokenthomas.nikolajsentuxillo12/05/2013 08:31 AM
2013BugIn ProgressNormaloversized DMA request loopjosepht01/14/2015 03:48 PM
(301-400/513) Per page: 25, 50, 100

Also available in: Atom CSV PDF